Configure Error Unable To Find Pygobject Codegen

RECOMMENDED: If you have Windows errors then we strongly recommend that you download and run this (Windows) Repair Tool.

Dec 22, 2009. For python-only projects, it's rather tedious to set up a C toolchain just to getthe. a similar fashion as PyGtk etc. windows versions are. checking for PYPOPPLER. configure: error: Package requirements ( pygtk-2.0 >= 2.10.0, I only find 'poppler.pyd' in the archive, perhaps that's why the import failed?

I want to install Accerciser my OS is fedora 16 I downloaded the package, 'cd' into the folder and run './configure' and get checking for PYGOBJECT. no configure.

I was unable to compile: checking for pygobject. no configure: error: could not find pygobject-codegen-2. patch to find pygobject-codegen-2. outside /opt.

[SOLVED] pygobect codegen errors – LinuxQuestions.org – pygobect codegen errors. I'm having problems trying to compile my pygtk, checking for codegen. configure: error: unable to find PyGObject codegen

checking for PYGOBJECT. no configure: error: Package requirements. [[email protected] kit accerciser-3.5.3]# rpm -qa|grep "pygobject" pygobject2-codegen-2.28.6-2.fc16.x86_64. I needed to apt-get install the python-gobject-dev package. Unable to install a package due missing shared object dependencies.

linux – Install python, pygtk in user's space – Stack Overflow – Mar 11, 2014. But, according to the configuration error provided, I don't think this helps in your. files, maybe some module (I don't know PyGObject specifics).

Aug 21, 2017. configure –prefix=/usr –docdir=/usr/share/doc/dbus-python-1.2.4 && make && popd. To test the. Installed Programs: pygobject-codegen-2.0.

Error Message V04 Bt Vision Been getting these errors anytime I try to watch something from the on demand on my BT Vision. BT Vision Errors code
Itunes Error 5002 On Mac Error 5002 problems include computer crashes, freezes, and possible virus infection. Learn how to fix these iTunes runtime errors quickly and easily!

I manually did a make and installed pygtk, but now I get this error: Quote:. File "/ usr/share/pygobject/2.0/codegen/codegen.py", line 429 except argtypes. Makefile:706: recipe for target 'install-recursive' failed. I'm sorry to see that you are having some issues with the Mycroft setup. You might be the first.

i am using fedora 17 and was trying to install pygobject 2.x and it configured flawlessy but while making it crashed. Making all in codegen make[2]: Entering directory. failed to create symbolic link `_glib.so': File exists make[2]: Leaving directory. Where to find help for missing Perl_Gthr_key_ptr symbol?

configure error unable to find pygobject codegen. here for a quick overview of the site Help Center Detailed answers to any questions you might have Meta Discuss the.

Snort Error Libpcre Library Not Found My question is, has anyone else been able to get a GUI for snort going on Kali? If so what. ERROR! daq_static

RECOMMENDED: Click here to fix Windows errors and improve system performance