Error C2470 Visual Studio

RECOMMENDED: If you have Windows errors then we strongly recommend that you download and run this (Windows) Repair Tool.

I'm making small lib for my R&D needs. For that needs I use Qt 4.8.6 and Visual Stuido 2012. Here's my.pro file TEMPLATE = lib TARGET = mylib CONFIG.

Gamecih Error The System Deny To Root Build the Security Descriptor and Trustee objects $sd = ([wmiclass] "$ComputerNamerootcimv2:Win32_SecurityDescriptor. Share created successfully’; break } 2 { Write-Error. May 27, 2012.

class exporting error (error C2470: looks like a function definition). Browse other questions tagged c++ class visual-studio-2005 or ask your own question.

Get Great Deals on Visual Studio. Download Now At The Official Microsoft® Store.

The articles in this part of the documentation contain information about a subsection of the Visual C++ compiler errors. You can access the information here or, in.

c++ – class exporting error (error C2470: looks like a function. – Mar 16, 2011. Somewhere you're including TCInfoSuVars.h before SDBIDI_ORIENT is defined – Make sure you include the header file that defines.

This tutorial will show you how to use GDI+ in your Win32 or MFC application. These step by step instructions will help you getting started with GDI+.

Microsoft this week issued its second preview of Visual Studio 2017 15.5, with several new features introduced. Various bug fixes were also announced, along.

c:documents and settingsmarkdesktopvisual studioweek4dilday_week 4 dilday_week 4dilday_week 4.cpp(19) : error C2470: 'Class' : looks.

Jul 11, 2012. Installation guide: OpenCV 2.4 with Visual Studio C++ 2010. I don't know if this has anything to do with it but this error shows up for all of the. studio 2010 projectstest3test3test3.cpp(19): error C2470: 'D' : looks like a.

Compiler Error C2470. Visual Studio.NET 2003 Other Versions Visual Studio 2015 ; Visual Studio 2013 ; Visual Studio 2012; Visual Studio 2010; Visual.

Apr 13, 2015. You haven't included any QT headers that might define Q_DECL_EXPORT or Q_DECL_IMPORT , nor are they defined by the command line.

Error 42703 Ibm Db2 Sql0206n Intel 5000 Series Chipset Error Reporting Registers 25f0 “Linley Gwennap, director of the esteemed chip industry research firm that bears his name,

Compiler Error C2470. Compiler Error C2471. Compiler Error C2440. The new home for Visual Studio documentation is Visual Studio 2017 Documentation on docs.

When I’m trying to install Visual Studio 2017, this error message appears: It is not possible to install the Visual Studio installer. Enable the Windows Service "Windows Management Instrumentation" and try again. What should I do? Every.

Mar 26, 2009. I encountered the same compiler error. instead of __declspec(dllexport) or no declspec at all as a class / function prefix in Visual C++.

If Cloud Explorer is installed with the Web development workload, launching Cloud Explorer may fail with error messages saying ‘Setup cannot proceed when Visual Studio is running. Please close Visual Studio and retry’. This is caused.

1>C:Program FilesMicrosoft Visual Studio 9.0VCceincludexiosbase(209) : error C2470: 'ios_base' : looks like a function definition, but there.

As you can see from the above screenshot, when my upgrade completed I.

RECOMMENDED: Click here to fix Windows errors and improve system performance