Fatal Error X11/extensions/xinerama.h

fatal error no such file or directory code blocks

RECOMMENDED: If you have Windows errors then we strongly recommend that you download and run this (Windows) Repair Tool.

Buy books at Amazon.com and save. Free Shipping on Qualified Orders.

Aug 23, 2011. This most likely means that the X11 development lib is not installed (I said. xdo. c:29:37: fatal error: X11/extensions/Xinerama.h: No such file or.

config.h (BOTTOM_BAR_HEIGHT is for the gap for my conkybar). #ifdef XINERAMA #include <X11/extensions/Xinerama.h> #endif /* macros. return 0; fprintf(stderr, "dwm: fatal error: request code=%d, error code=%dn",

Standard Error Small Sample Size Deworming has been a standard practice for children in many developing. and. Sample Size for a Margin of Error in Statistics –

test.cpp:1:22: fatal error: X11/Xlib.h: No such file or directory compilation terminated. you need to install X11 development libraries.

Sep 14, 2011. cc CC dwm.c dwm.c:40:37: fatal error: X11/extensions/Xinerama.h: No such file or directory compilation terminated. make: *** [dwm.o] Error 1.

Feb 22, 2011. Install libxtst-dev package and you'll be able to compile Chromium sources.

ubuntu – How to find X11/extensions/XTest.h – Stack Overflow – I am using ubuntu 10.10, and when i compile chromium, it said remoting/host/event_executor_linux.cc:9: fatal error: X11/extensions/XTest.h: No such file or directory.

Viewmail Voicemail Server Returns Error Our verdict is that, despite some flaws and feature omissions, the iPhone is, on balance, a beautiful and breakthrough handheld computer. Its
Error 53 File Not Found Access File not found (Error 53) – msdn.microsoft.com – 75 Path\File access error. File not found (Error 53) Specifics. The file was not

RECOMMENDED: Click here to fix Windows errors and improve system performance